КОСМЕТИЧЕСКОЕ СРЕДСТВО
type: LexicalConcept
association2: http://lod.ruthes.org/resource/concept/111546
association2: http://lod.ruthes.org/resource/concept/144747
holonym: http://lod.ruthes.org/resource/concept/143066
hypernym: http://lod.ruthes.org/resource/concept/1254
hyponym: http://lod.ruthes.org/resource/concept/107321
hyponym: http://lod.ruthes.org/resource/concept/115261
hyponym: http://lod.ruthes.org/resource/concept/126675
hyponym: http://lod.ruthes.org/resource/concept/135700
hyponym: http://lod.ruthes.org/resource/concept/143870
hyponym: http://lod.ruthes.org/resource/concept/151666
hyponym: http://lod.ruthes.org/resource/concept/9661
definition: вещества, служащие для улучшения внешности; в разговорной речи применяется в основном к декоративной косметике
in scheme: ruthes
lexicalized sense: 109170-косметика-n-0
lexicalized sense: 109170-косметическая линия-ng-0
lexicalized sense: 109170-косметическая продукция-ng-0
lexicalized sense: 109170-косметические изделия-ng-0
lexicalized sense: 109170-косметические принадлежности-ng-0
lexicalized sense: 109170-косметические товары-ng-0
lexicalized sense: 109170-косметический-adj-0
lexicalized sense: 109170-косметический препарат-ng-0
lexicalized sense: 109170-косметическое средство-ng-0
lexicalized sense: 109170-лечебно-косметические товары-ng-0