ШРИФТ
type: LexicalConcept
association1: http://lod.ruthes.org/resource/concept/107076
holonym: http://lod.ruthes.org/resource/concept/4142
hypernym: http://lod.ruthes.org/resource/concept/106559
hyponym: http://lod.ruthes.org/resource/concept/109548
hyponym: http://lod.ruthes.org/resource/concept/109836
definition: гарнитура совокупность букв и других печатных знаков с определенными особенностями рисунка штрихов и пропорциями
in scheme: ruthes
lexicalized sense: 109549-шрифт-n-0
lexicalized sense: 109549-шрифтовой-adj-0