УНЦИЯ
type: LexicalConcept
hypernym: http://lod.ruthes.org/resource/concept/3458
hyponym: http://lod.ruthes.org/resource/concept/129925
definition: единица веса, равная 28,35 г (применявшаяся в Древнем Риме и в ряде европейских государств до введения метрической системы мер в 1918 г.)
in scheme: ruthes
lexicalized sense: 109974-унция-n-0