ЦАРЬ (МОНАРХ)
type: LexicalConcept
association2: http://lod.ruthes.org/resource/concept/142569
hypernym: http://lod.ruthes.org/resource/concept/110193
hyponym: http://lod.ruthes.org/resource/concept/121732
hyponym: http://lod.ruthes.org/resource/concept/127541
definition: самодержец, единовластный государь, правитель страны
in scheme: ruthes
lexicalized sense: 110194-царица-n-0
lexicalized sense: 110194-царский-adj-0
lexicalized sense: 110194-царь-n-0