ГРАММАТИЧЕСКОЕ ЧИСЛО
type: LexicalConcept
hypernym: http://lod.ruthes.org/resource/concept/110584
hyponym: http://lod.ruthes.org/resource/concept/110596
hyponym: http://lod.ruthes.org/resource/concept/110597
definition: в ряде естественных языков — грамматическая категория имени и глагола, позволяющая выразить единичность или множественность
in scheme: ruthes
lexicalized sense: 110595-грамматическое число-ng-0
lexicalized sense: 110595-число-n-0