ГРАММАТИКА ЯЗЫКА
type: LexicalConcept
holonym: http://lod.ruthes.org/resource/concept/2798
hypernym: http://lod.ruthes.org/resource/concept/106575
hyponym: http://lod.ruthes.org/resource/concept/110599
hyponym: http://lod.ruthes.org/resource/concept/110600
hyponym: http://lod.ruthes.org/resource/concept/110601
hyponym: http://lod.ruthes.org/resource/concept/117675
meronym: http://lod.ruthes.org/resource/concept/110592
meronym: http://lod.ruthes.org/resource/concept/129098
meronym: http://lod.ruthes.org/resource/concept/135101
definition: формальный строй языка, система его морфологических и синтаксических категорий и форм
in scheme: ruthes
lexicalized sense: 110598-грамматика-n-0
lexicalized sense: 110598-грамматика языка-ng-0
lexicalized sense: 110598-грамматический-adj-0