СИНТАКСИС
type: LexicalConcept
hypernym: http://lod.ruthes.org/resource/concept/110598
meronym: http://lod.ruthes.org/resource/concept/137259
definition: раздел языкознания, грамматики, изучающий законы соединения слов и строения предложений
in scheme: ruthes
lexicalized sense: 110601-синтаксис-n-0
lexicalized sense: 110601-синтаксическая структура-ng-0
lexicalized sense: 110601-синтаксический-adj-0