ГРАММАТИЧЕСКОЕ ЛИЦО
type: LexicalConcept
holonym: http://lod.ruthes.org/resource/concept/110615
hypernym: http://lod.ruthes.org/resource/concept/110584
definition: грамматическая категория, показывающая, идет ли речь о говорящем (первое лицо), или о том, с кем он говорит (второе лицо), или же о ком-чем-н. третьем (третье лицо)
in scheme: ruthes
lexicalized sense: 110629-грамматическая категория лица-ng-0
lexicalized sense: 110629-грамматическое лицо-ng-0
lexicalized sense: 110629-лицо-n-0