МЕДИЦИНСКАЯ ПОВЯЗКА
type: LexicalConcept
association1: http://lod.ruthes.org/resource/concept/147417
holonym: http://lod.ruthes.org/resource/concept/111428
hypernym: http://lod.ruthes.org/resource/concept/1068
hyponym: http://lod.ruthes.org/resource/concept/113309
hyponym: http://lod.ruthes.org/resource/concept/116865
hyponym: http://lod.ruthes.org/resource/concept/117261
hyponym: http://lod.ruthes.org/resource/concept/117522
meronym: http://lod.ruthes.org/resource/concept/3432
definition: бинт или другой перевязочный материал, наложенный на повреждённую часть тела, закрывающий рану
in scheme: ruthes
lexicalized sense: 111429-медицинская повязка-ng-0
lexicalized sense: 111429-повязка-n-0