УЛЫБКА
type: LexicalConcept
association2: http://lod.ruthes.org/resource/concept/124860
association2: http://lod.ruthes.org/resource/concept/140551
hypernym: http://lod.ruthes.org/resource/concept/112037
hypernym: http://lod.ruthes.org/resource/concept/126984
hyponym: http://lod.ruthes.org/resource/concept/120440
definition: мимическое движение или состояние лица, показывающее расположенность к смеху или выражающая привет, удовольствие либо иронию, насмешку
in scheme: ruthes
lexicalized sense: 112039-заулыбаться-v-0
lexicalized sense: 112039-улыбаться-v-0
lexicalized sense: 112039-улыбка-n-0
lexicalized sense: 112039-улыбнуться-v-0
lexicalized sense: 112039-улыбочка-n-0