РАСПРОДАТЬ
type: LexicalConcept
association: http://lod.ruthes.org/resource/concept/114450
hypernym: http://lod.ruthes.org/resource/concept/2055
meronym: http://lod.ruthes.org/resource/concept/574
definition: сбыт товара с целью быстрой ликвидации всего имеющегося запаса
in scheme: ruthes
lexicalized sense: 112184-продать влет-vg-0
lexicalized sense: 112184-распродавать-v-0
lexicalized sense: 112184-распродажа-n-0
lexicalized sense: 112184-распродать-v-0
lexicalized sense: 112184-распродать влет-vg-0
lexicalized sense: 112184-уйти влет-vg-0
lexicalized sense: 112184-уходить влет-vg-0