СКОПЛЕНИЕ (БОЛЬШОЕ КОЛИЧЕСТВО)
type: LexicalConcept
association1: http://lod.ruthes.org/resource/concept/118734
hypernym: http://lod.ruthes.org/resource/concept/107160
hyponym: http://lod.ruthes.org/resource/concept/112325
hyponym: http://lod.ruthes.org/resource/concept/116224
hyponym: http://lod.ruthes.org/resource/concept/116931
hyponym: http://lod.ruthes.org/resource/concept/124472
hyponym: http://lod.ruthes.org/resource/concept/125338
hyponym: http://lod.ruthes.org/resource/concept/127380
hyponym: http://lod.ruthes.org/resource/concept/141303
definition: большое количество людей, других существ или объектов, собравшихся в каком-то месте
in scheme: ruthes
lexicalized sense: 112324-скопление-n-0