УЧИТЬСЯ, ОБУЧАТЬСЯ
type: LexicalConcept
association2: http://lod.ruthes.org/resource/concept/118370
association2: http://lod.ruthes.org/resource/concept/134424
association2: http://lod.ruthes.org/resource/concept/142488
holonym: http://lod.ruthes.org/resource/concept/1604
hypernym: http://lod.ruthes.org/resource/concept/130167
hypernym: http://lod.ruthes.org/resource/concept/133979
hyponym: http://lod.ruthes.org/resource/concept/106684
hyponym: http://lod.ruthes.org/resource/concept/112840
hyponym: http://lod.ruthes.org/resource/concept/137110
definition: усваивать знания, умения, навыки в какой-либо области
in scheme: ruthes
lexicalized sense: 112839-выучиться-v-0
lexicalized sense: 112839-доучиваться-v-0
lexicalized sense: 112839-доучиться-v-0
lexicalized sense: 112839-научаться-v-0
lexicalized sense: 112839-научиться-v-0
lexicalized sense: 112839-обучаться-v-0
lexicalized sense: 112839-обучиться-v-0
lexicalized sense: 112839-поучиться-v-0
lexicalized sense: 112839-проучиться-v-0
lexicalized sense: 112839-учеба-n-0
lexicalized sense: 112839-учение-n-0
lexicalized sense: 112839-ученье-n-0
lexicalized sense: 112839-учиться-v-0