БАЛЕРИНА
type: LexicalConcept
association2: http://lod.ruthes.org/resource/concept/120945
association2: http://lod.ruthes.org/resource/concept/121038
association2: http://lod.ruthes.org/resource/concept/121700
holonym: http://lod.ruthes.org/resource/concept/121689
holonym: http://lod.ruthes.org/resource/concept/132556
hypernym: http://lod.ruthes.org/resource/concept/110451
hyponym: http://lod.ruthes.org/resource/concept/114293
definition: профессинальная танцовщица, артистка балета
in scheme: ruthes
lexicalized sense: 113132-артистка балета-ng-0
lexicalized sense: 113132-балерина-n-0
lexicalized sense: 113132-танцовщица-n-0