ГРОМ (ПРИРОДНОЕ ЯВЛЕНИЕ)
type: LexicalConcept
association: http://lod.ruthes.org/resource/concept/113173
holonym: http://lod.ruthes.org/resource/concept/10208
hypernym: http://lod.ruthes.org/resource/concept/107357
hypernym: http://lod.ruthes.org/resource/concept/111
hypernym: http://lod.ruthes.org/resource/concept/113476
definition: атмосферное явление, раскатистый сильный звук, сопровождающий удар молнии
in scheme: ruthes
lexicalized sense: 113172-гром-n-0
lexicalized sense: 113172-громовой-adj-0
lexicalized sense: 113172-раскаты грома-ng-0