ЗНАМЕНАТЕЛЬ
type: LexicalConcept
holonym: http://lod.ruthes.org/resource/concept/113293
hypernym: http://lod.ruthes.org/resource/concept/110699
definition: делитель в дроби; число, показывающее (знаменующее) размеры долей единицы, из которых составлена дробь
in scheme: ruthes
lexicalized sense: 113295-знаменатель-n-0