СУЕВЕРИЕ
type: LexicalConcept
association2: http://lod.ruthes.org/resource/concept/120363
hypernym: http://lod.ruthes.org/resource/concept/107144
meronym: http://lod.ruthes.org/resource/concept/121366
definition: вера в сверхъестественные силы, основанная на боязни и необразованности
in scheme: ruthes
lexicalized sense: 113539-суеверие-n-0
lexicalized sense: 113539-суеверный-adj-0