НИЗКИЙ, МЕНЬШЕ НОРМЫ
type: LexicalConcept
association1: http://lod.ruthes.org/resource/concept/106513
association2: http://lod.ruthes.org/resource/concept/113822
association2: http://lod.ruthes.org/resource/concept/138164
holonym: http://lod.ruthes.org/resource/concept/106515
hypernym: http://lod.ruthes.org/resource/concept/106760
hyponym: http://lod.ruthes.org/resource/concept/114841
hyponym: http://lod.ruthes.org/resource/concept/115949
hyponym: http://lod.ruthes.org/resource/concept/121223
hyponym: http://lod.ruthes.org/resource/concept/131976
definition: пониженный, имеющий величину меньше нормальной; не достигший средней нормы, должного уровня чего-либо
in scheme: ruthes
lexicalized sense: 113824-меньше нормы-adjg-0
lexicalized sense: 113824-ниже нормы-adjg-0
lexicalized sense: 113824-низкий-adj-0
lexicalized sense: 113824-низший-adj-0
lexicalized sense: 113824-пониженный-adj-0