ПОСТФИКС
type: LexicalConcept
hypernym: http://lod.ruthes.org/resource/concept/124077
hyponym: http://lod.ruthes.org/resource/concept/110613
hyponym: http://lod.ruthes.org/resource/concept/110614
definition: в ряде языков — часть слова, аффикс, располагающийся после корня; в русском и ряде других языков — возвратная морфема, обычно стоящая после окончания
in scheme: ruthes
lexicalized sense: 113860-постфикс-n-0
lexicalized sense: 113860-постфиксальный-adj-0