ДОМОГАТЕЛЬСТВО
type: LexicalConcept
hypernym: http://lod.ruthes.org/resource/concept/106476
definition: настойчивое, назойливое стремление достигнуть чего-либо, получить что-либо, добиться чего-либо
in scheme: ruthes
lexicalized sense: 113880-домогательство-n-0
lexicalized sense: 113880-домогаться-v-0