НЕБОЛЬШОЙ, МАЛЫЙ
type: LexicalConcept
holonym: http://lod.ruthes.org/resource/concept/106515
hypernym: http://lod.ruthes.org/resource/concept/106775
hyponym: http://lod.ruthes.org/resource/concept/114023
hyponym: http://lod.ruthes.org/resource/concept/114204
hyponym: http://lod.ruthes.org/resource/concept/114205
hyponym: http://lod.ruthes.org/resource/concept/114313
hyponym: http://lod.ruthes.org/resource/concept/114314
hyponym: http://lod.ruthes.org/resource/concept/114335
hyponym: http://lod.ruthes.org/resource/concept/114368
hyponym: http://lod.ruthes.org/resource/concept/114389
hyponym: http://lod.ruthes.org/resource/concept/115147
hyponym: http://lod.ruthes.org/resource/concept/115634
hyponym: http://lod.ruthes.org/resource/concept/115907
hyponym: http://lod.ruthes.org/resource/concept/118858
hyponym: http://lod.ruthes.org/resource/concept/118958
hyponym: http://lod.ruthes.org/resource/concept/119587
hyponym: http://lod.ruthes.org/resource/concept/119809
hyponym: http://lod.ruthes.org/resource/concept/119817
hyponym: http://lod.ruthes.org/resource/concept/121512
hyponym: http://lod.ruthes.org/resource/concept/131976
hyponym: http://lod.ruthes.org/resource/concept/132616
hyponym: http://lod.ruthes.org/resource/concept/132618
hyponym: http://lod.ruthes.org/resource/concept/137231
hyponym: http://lod.ruthes.org/resource/concept/137741
hyponym: http://lod.ruthes.org/resource/concept/137911
hyponym: http://lod.ruthes.org/resource/concept/154793
definition: маленький имеющий незначительную величину, небольшой размер, вес и т. п.
in scheme: ruthes
lexicalized sense: 114022-маленький-adj-0
lexicalized sense: 114022-малость-n-0
lexicalized sense: 114022-малый-adj-0
lexicalized sense: 114022-меньший-adj-0
lexicalized sense: 114022-не велик-adjg-0
lexicalized sense: 114022-небольшой-adj-0
lexicalized sense: 114022-незначительный-adj-0
lexicalized sense: 114022-некрупный-adj-0