НОСТАЛЬГИЯ ПО РОДИНЕ
type: LexicalConcept
association1: http://lod.ruthes.org/resource/concept/133513
hypernym: http://lod.ruthes.org/resource/concept/114032
definition: болезненная тоска по родине, по родному краю, по связи с домом или минувшему, утраченному
in scheme: ruthes
lexicalized sense: 114033-ностальгировать-v-0
lexicalized sense: 114033-ностальгирующий-adj-0
lexicalized sense: 114033-ностальгический-adj-0
lexicalized sense: 114033-ностальгия-n-0
lexicalized sense: 114033-ностальгия по родине-ng-0
lexicalized sense: 114033-скучать по родине-vg-0
lexicalized sense: 114033-тоска по родине-ng-0