ГОРЕ, ЧУВСТВО ГОРЯ
type: LexicalConcept
holonym: http://lod.ruthes.org/resource/concept/117367
hypernym: http://lod.ruthes.org/resource/concept/106661
hyponym: http://lod.ruthes.org/resource/concept/106662
definition: тяжёлое чувство, вызываемое бедой, несчастьем, неудачей
in scheme: ruthes
lexicalized sense: 114099-горе-n-0
lexicalized sense: 114099-горесть-n-0
lexicalized sense: 114099-чувство горя-ng-0