ПОРОК (БОЛЬШОЙ НЕДОСТАТОК)
type: LexicalConcept
hypernym: http://lod.ruthes.org/resource/concept/106499
hyponym: http://lod.ruthes.org/resource/concept/151867
definition: предосудительный недостаток кого-либо, чего-либо; свойство, достойное осуждения, порицания
in scheme: ruthes
lexicalized sense: 114186-порок-n-0