ОБЕЛИСК
type: LexicalConcept
hypernym: http://lod.ruthes.org/resource/concept/114370
hypernym: http://lod.ruthes.org/resource/concept/128056
definition: памятник, каменное сооружение в виде столба (наиболее часто четырёхгранного), сужающегося кверху
in scheme: ruthes
lexicalized sense: 114371-обелиск-n-0
lexicalized sense: 114371-обелисковый-adj-0