КАЛЕНДАРНАЯ ДАТА
type: LexicalConcept
association2: http://lod.ruthes.org/resource/concept/114434
association2: http://lod.ruthes.org/resource/concept/114435
association2: http://lod.ruthes.org/resource/concept/130756
association2: http://lod.ruthes.org/resource/concept/135616
hypernym: http://lod.ruthes.org/resource/concept/106722
hyponym: http://lod.ruthes.org/resource/concept/137972
hyponym: http://lod.ruthes.org/resource/concept/143768
hyponym: http://lod.ruthes.org/resource/concept/152592
hyponym: http://lod.ruthes.org/resource/concept/619
hyponym: http://lod.ruthes.org/resource/concept/6950
meronym: http://lod.ruthes.org/resource/concept/118551
definition: обозначение времени с указанием дня, месяца и года
in scheme: ruthes
lexicalized sense: 114433-дата-n-0
lexicalized sense: 114433-день-n-0
lexicalized sense: 114433-календарная дата-ng-0
lexicalized sense: 114433-календарный день-ng-0
lexicalized sense: 114433-число, месяц, год-ng-0