СООБЩЕНИЕ В ПЕЧАТИ
type: LexicalConcept
holonym: http://lod.ruthes.org/resource/concept/1360
hypernym: http://lod.ruthes.org/resource/concept/106605
hypernym: http://lod.ruthes.org/resource/concept/146913
hyponym: http://lod.ruthes.org/resource/concept/126227
definition: оперативный жанр журналистики, сообщения с мест, статьи, присланные в газету или журнал корреспондентами
in scheme: ruthes
lexicalized sense: 114811-корреспонденция-n-0
lexicalized sense: 114811-сообщение в печати-ng-0