НЕВЗРАЧНЫЙ НА ВИД
type: LexicalConcept
hypernym: http://lod.ruthes.org/resource/concept/114408
definition: невзрачный на вид, внешне некрасивый; непривлекательный
in scheme: ruthes
lexicalized sense: 114815-невзрачность-n-0
lexicalized sense: 114815-невзрачный-adj-0
lexicalized sense: 114815-невзрачный на вид-adjg-0
lexicalized sense: 114815-неказистость-n-0
lexicalized sense: 114815-неказистый-adj-0
lexicalized sense: 114815-неприглядность-n-0
lexicalized sense: 114815-неприглядный-adj-0