ОБВЕСИТЬ (НЕДОВЕСИТЬ)
type: LexicalConcept
association1: http://lod.ruthes.org/resource/concept/110409
hypernym: http://lod.ruthes.org/resource/concept/5792
definition: отпуская какой-либо товар вразвес, недовешивать, отвешивать меньше положенного по ошибке или с целью обмана
in scheme: ruthes
lexicalized sense: 114880-недовес-n-0
lexicalized sense: 114880-недовесить-v-0
lexicalized sense: 114880-недовешивать-v-0
lexicalized sense: 114880-обвес-n-0
lexicalized sense: 114880-обвесить-v-0
lexicalized sense: 114880-обвешивание-n-0
lexicalized sense: 114880-обвешивать-v-0