РАПОРТ (СЛУЖЕБНОЕ СООБЩЕНИЕ)
type: LexicalConcept
holonym: http://lod.ruthes.org/resource/concept/128678
hypernym: http://lod.ruthes.org/resource/concept/106605
definition: служебное сообщение, донесение младшего по званию старшему военному начальнику
in scheme: ruthes
lexicalized sense: 114960-рапорт-n-0