ЛИКОВАНИЕ
type: LexicalConcept
hypernym: http://lod.ruthes.org/resource/concept/106657
hyponym: http://lod.ruthes.org/resource/concept/120767
definition: бурно радоваться, испытывать и выражать восторг
in scheme: ruthes
lexicalized sense: 115175-возликовать-v-0
lexicalized sense: 115175-ликование-n-0
lexicalized sense: 115175-ликовать-v-0