ДОГАДКА
type: LexicalConcept
holonym: http://lod.ruthes.org/resource/concept/117028
hypernym: http://lod.ruthes.org/resource/concept/115288
hyponym: http://lod.ruthes.org/resource/concept/115512
definition: недоказанное утверждение, предположение, выдвигаемое для объяснения какого-либо явления
in scheme: ruthes
lexicalized sense: 115289-гипотеза-n-0
lexicalized sense: 115289-догадка-n-0