ФИЛАРМОНИЯ (УЧРЕЖДЕНИЕ)
type: LexicalConcept
hypernym: http://lod.ruthes.org/resource/concept/1445
hypernym: http://lod.ruthes.org/resource/concept/7545
definition: концертная организация, пропагандирующая классическую и современную музыку среди широкого круга слушателей
in scheme: ruthes
lexicalized sense: 115397-филармонический-adj-0
lexicalized sense: 115397-филармонический коллектив-ng-0
lexicalized sense: 115397-филармония-n-0