ТОЛСТЫЙ, ТУЧНЫЙ
type: LexicalConcept
association2: http://lod.ruthes.org/resource/concept/118992
association2: http://lod.ruthes.org/resource/concept/133995
association2: http://lod.ruthes.org/resource/concept/134446
holonym: http://lod.ruthes.org/resource/concept/124264
hypernym: http://lod.ruthes.org/resource/concept/115633
hyponym: http://lod.ruthes.org/resource/concept/115636
hyponym: http://lod.ruthes.org/resource/concept/123597
hyponym: http://lod.ruthes.org/resource/concept/144734
definition: упитанный, толстый, жирный (о человеке или животном)
in scheme: ruthes
lexicalized sense: 115635-грузность-n-0
lexicalized sense: 115635-грузный-adj-0
lexicalized sense: 115635-как бочка-ng-0
lexicalized sense: 115635-мясистость-n-0
lexicalized sense: 115635-мясистый-adj-0
lexicalized sense: 115635-полненький-adj-0
lexicalized sense: 115635-полноватый-adj-0
lexicalized sense: 115635-полнота-n-0
lexicalized sense: 115635-полный-adj-0
lexicalized sense: 115635-пузатость-n-0
lexicalized sense: 115635-пузатый-adj-0
lexicalized sense: 115635-пышнотелый-adj-0
lexicalized sense: 115635-толстенный-adj-0
lexicalized sense: 115635-толстопузость-n-0
lexicalized sense: 115635-толстопузый-adj-0
lexicalized sense: 115635-толстый-adj-0
lexicalized sense: 115635-толстый как бочка-adjg-0
lexicalized sense: 115635-толщина-n-0
lexicalized sense: 115635-тучность-n-0
lexicalized sense: 115635-тучный-adj-0
lexicalized sense: 115635-упитанность-n-0
lexicalized sense: 115635-упитанный-adj-0