КРУТОЙ (ОТВЕСНЫЙ, ОБРЫВИСТЫЙ)
type: LexicalConcept
holonym: http://lod.ruthes.org/resource/concept/107567
hypernym: http://lod.ruthes.org/resource/concept/114019
hypernym: http://lod.ruthes.org/resource/concept/115906
hyponym: http://lod.ruthes.org/resource/concept/115909
definition: характеристика большого угла наклона чего-либо
in scheme: ruthes
lexicalized sense: 115908-крутизна-n-0
lexicalized sense: 115908-крутой-adj-0
lexicalized sense: 115908-крутость-n-0