АВАНПОСТ
type: LexicalConcept
hypernym: http://lod.ruthes.org/resource/concept/115917
definition: передовой сторожевой пост, выставляемый в целях предупреждения внезапного нападения противника; место расположения такого поста
in scheme: ruthes
lexicalized sense: 115918-аванпост-n-0
lexicalized sense: 115918-аванпостный-adj-0
lexicalized sense: 115918-форпост-n-0
lexicalized sense: 115918-форпостный-adj-0