ЗАТОР
type: LexicalConcept
holonym: http://lod.ruthes.org/resource/concept/116223
hypernym: http://lod.ruthes.org/resource/concept/112324
hyponym: http://lod.ruthes.org/resource/concept/129843
definition: задержка или остановка в движении из-за скопления движущихся в одном направлении людей, предметов и т. п.; скопление людей, предметов и т. п., препятствующее движению
in scheme: ruthes
lexicalized sense: 116224-затор-n-0
lexicalized sense: 116224-заторный-adj-0
lexicalized sense: 116224-пробка-n-0