ВЗЫСКАНИЕ (НАКАЗАНИЕ)
type: LexicalConcept
association2: http://lod.ruthes.org/resource/concept/149104
hypernym: http://lod.ruthes.org/resource/concept/1847
hyponym: http://lod.ruthes.org/resource/concept/1524
hyponym: http://lod.ruthes.org/resource/concept/3694
definition: наказание за невыполнение или нарушение чего-либо
in scheme: ruthes
lexicalized sense: 116489-взыскание-n-0
lexicalized sense: 116489-мера взыскания-ng-0