УГОНЩИК
type: LexicalConcept
holonym: http://lod.ruthes.org/resource/concept/116787
hypernym: http://lod.ruthes.org/resource/concept/115323
hypernym: http://lod.ruthes.org/resource/concept/639
hyponym: http://lod.ruthes.org/resource/concept/144606
definition: тот, кто совершает угон, угоняет, крадёт то, что способно к самостоятельному передвижению (транспорт, скот)
in scheme: ruthes
lexicalized sense: 116795-угонщик-n-0
lexicalized sense: 116795-угонщица-n-0