ИСТОЩЕНИЕ (КРАЙНЯЯ СЛАБОСТЬ)
type: LexicalConcept
holonym: http://lod.ruthes.org/resource/concept/118663
hypernym: http://lod.ruthes.org/resource/concept/117322
hyponym: http://lod.ruthes.org/resource/concept/109191
definition: крайняя слабость, потеря сил, изнурённость
in scheme: ruthes
lexicalized sense: 117323-истощение-n-0