ПОДРАБОТКА, ДОПОЛНИТЕЛЬНАЯ РАБОТА
type: LexicalConcept
hypernym: http://lod.ruthes.org/resource/concept/116538
hypernym: http://lod.ruthes.org/resource/concept/133827
definition: подработка; побочный заработок; работа, выполняемая помимо или за счёт основной
in scheme: ruthes
lexicalized sense: 117687-дополнительная работа-ng-0
lexicalized sense: 117687-левая работа-ng-0
lexicalized sense: 117687-побочная работа-ng-0
lexicalized sense: 117687-подзаработать-v-0
lexicalized sense: 117687-подрабатывание-n-0
lexicalized sense: 117687-подрабатывать-v-0
lexicalized sense: 117687-подработать-v-0
lexicalized sense: 117687-подработать халтурой-vg-0
lexicalized sense: 117687-подработка-n-0
lexicalized sense: 117687-подхалтурить-v-0
lexicalized sense: 117687-прирабатывать-v-0
lexicalized sense: 117687-приработать-v-0
lexicalized sense: 117687-приработка-n-0
lexicalized sense: 117687-халтура-n-0
lexicalized sense: 117687-халтурить-v-0
lexicalized sense: 117687-халтурка-n-0