УСЕРДНЫЙ
type: LexicalConcept
holonym: http://lod.ruthes.org/resource/concept/113867
hypernym: http://lod.ruthes.org/resource/concept/118028
hyponym: http://lod.ruthes.org/resource/concept/106930
hyponym: http://lod.ruthes.org/resource/concept/118029
hyponym: http://lod.ruthes.org/resource/concept/118323
hyponym: http://lod.ruthes.org/resource/concept/140910
definition: действующий с усердием, проявляющий в чём-либо усердие
in scheme: ruthes
lexicalized sense: 118027-усердность-n-0
lexicalized sense: 118027-усердный-adj-0