ПОРЯДОЧНЫЙ, ДОБРОПОРЯДОЧНЫЙ
type: LexicalConcept
association: http://lod.ruthes.org/resource/concept/119369
association2: http://lod.ruthes.org/resource/concept/125217
hypernym: http://lod.ruthes.org/resource/concept/118717
hyponym: http://lod.ruthes.org/resource/concept/119309
hyponym: http://lod.ruthes.org/resource/concept/123392
definition: отличающийся положительными качествами; порядочный
in scheme: ruthes
lexicalized sense: 118057-добропорядочность-n-0
lexicalized sense: 118057-добропорядочный-adj-0
lexicalized sense: 118057-порядочность-n-0
lexicalized sense: 118057-порядочный-adj-0
lexicalized sense: 118057-приличный-adj-0