ЧИСТОКРОВНЫЙ, ЧИСТОПОРОДНЫЙ
type: LexicalConcept
association: http://lod.ruthes.org/resource/concept/125371
association1: http://lod.ruthes.org/resource/concept/115936
association2: http://lod.ruthes.org/resource/concept/125844
holonym: http://lod.ruthes.org/resource/concept/4405
hypernym: http://lod.ruthes.org/resource/concept/118101
definition: не смешанной породы, чистой крови (о домашних животных)
in scheme: ruthes
lexicalized sense: 118100-племенной-adj-0
lexicalized sense: 118100-породистость-n-0
lexicalized sense: 118100-породистый-adj-0
lexicalized sense: 118100-породность-n-0
lexicalized sense: 118100-породный-adj-0
lexicalized sense: 118100-чистокровность-n-0
lexicalized sense: 118100-чистокровный-adj-0
lexicalized sense: 118100-чистопородность-n-0
lexicalized sense: 118100-чистопородный-adj-0