СТРАННЫЙ
type: LexicalConcept
hypernym: http://lod.ruthes.org/resource/concept/118141
hyponym: http://lod.ruthes.org/resource/concept/118147
hyponym: http://lod.ruthes.org/resource/concept/118563
hyponym: http://lod.ruthes.org/resource/concept/123854
hyponym: http://lod.ruthes.org/resource/concept/124830
hyponym: http://lod.ruthes.org/resource/concept/124843
hyponym: http://lod.ruthes.org/resource/concept/135692
hyponym: http://lod.ruthes.org/resource/concept/146434
definition: редкий, необыкновенный, вызывающий удивление; небывалый, невиданный, неслыханный
in scheme: ruthes
lexicalized sense: 118146-диковинный-adj-0
lexicalized sense: 118146-престранный-adj-0
lexicalized sense: 118146-странноватый-adj-0
lexicalized sense: 118146-странность-n-0
lexicalized sense: 118146-странный-adj-0