ЭКЗОТИЧНЫЙ
type: LexicalConcept
hypernym: http://lod.ruthes.org/resource/concept/118146
definition: отличающийся экзотикой; причудливый, диковинный
in scheme: ruthes
lexicalized sense: 118147-экзотика-n-0
lexicalized sense: 118147-экзотический-adj-0
lexicalized sense: 118147-экзотичность-n-0
lexicalized sense: 118147-экзотичный-adj-0