НОРМАЛЬНЫЙ (ОБЫЧНЫЙ)
type: LexicalConcept
association: http://lod.ruthes.org/resource/concept/119061
association2: http://lod.ruthes.org/resource/concept/154915
hypernym: http://lod.ruthes.org/resource/concept/118165
hyponym: http://lod.ruthes.org/resource/concept/119899
definition: соответствие нормам, норме; нормальное состояние чего-либо
in scheme: ruthes
lexicalized sense: 118164-нормальность-n-0
lexicalized sense: 118164-нормальный-adj-0