ФЕНОМЕНАЛЬНЫЙ
type: LexicalConcept
holonym: http://lod.ruthes.org/resource/concept/137366
hypernym: http://lod.ruthes.org/resource/concept/118229
definition: соотносящийся по знач. с сущ. феномен, связанный с ним
in scheme: ruthes
lexicalized sense: 118230-феноменальность-n-0
lexicalized sense: 118230-феноменальный-adj-0