ОТЗЫВЧИВЫЙ
type: LexicalConcept
association: http://lod.ruthes.org/resource/concept/119404
hypernym: http://lod.ruthes.org/resource/concept/119093
hypernym: http://lod.ruthes.org/resource/concept/119430
hypernym: http://lod.ruthes.org/resource/concept/119941
hyponym: http://lod.ruthes.org/resource/concept/118328
definition: сочувственно относящийся к нуждам других, готовый помочь
in scheme: ruthes
lexicalized sense: 118327-отзывчивость-n-0
lexicalized sense: 118327-отзывчивый-adj-0