ЯРКИЙ ПО ЦВЕТУ
type: LexicalConcept
association: http://lod.ruthes.org/resource/concept/118231
association2: http://lod.ruthes.org/resource/concept/119688
holonym: http://lod.ruthes.org/resource/concept/106944
hypernym: http://lod.ruthes.org/resource/concept/119007
hypernym: http://lod.ruthes.org/resource/concept/135635
hyponym: http://lod.ruthes.org/resource/concept/119030
hyponym: http://lod.ruthes.org/resource/concept/119672
hyponym: http://lod.ruthes.org/resource/concept/120717
hyponym: http://lod.ruthes.org/resource/concept/124830
hyponym: http://lod.ruthes.org/resource/concept/151572
definition: (о цвете) светлый и насыщенный, резко отличающийся от белого и серого
in scheme: ruthes
lexicalized sense: 118355-интенсивность-n-0
lexicalized sense: 118355-интенсивный-adj-0
lexicalized sense: 118355-интенсивный по цвету-adjg-0
lexicalized sense: 118355-насыщенность-n-0
lexicalized sense: 118355-насыщенный-adj-0
lexicalized sense: 118355-насыщенный по цвету-adjg-0
lexicalized sense: 118355-яркий-adj-0
lexicalized sense: 118355-яркий по цвету-adjg-0
lexicalized sense: 118355-яркость-n-0